{"text_format":"1","workbook":"xlsx","n_sheets":9,"sheets":["TRAVEL DOCUMENT","Drop Down Menu","TIW","TIW-2","TIW-3","TIW-4","Lodging Exception Form 2","Rental Exception Request","Sheet2"],"not_rendered":{"charts":0,"images":3,"macros":1,"external_links":1,"defined_names":30,"comments":0,"pivot_tables":0},"unopened":[],"bounds":{"document_bytes":16777216,"sheet_cells":100000,"rows_first":2000,"rows_last":500,"rows_between":2000,"halvings":0,"cell_chars":16384,"cell_head_chars":4096},"cells_cut":0,"cells_raw":0,"read":"whole","date_system":"1900"}

{"sheet":"TRAVEL DOCUMENT","index":0,"n_rows":36,"n_cols":19,"rows_kept":36,"cut":false,"hidden":false,"merged":[[35,1,35,17],[30,1,30,2],[30,4,30,6],[30,10,30,11],[30,12,30,13],[30,15,30,16],[31,1,31,2],[31,4,31,6],[31,10,31,11],[31,12,31,13],[31,15,31,16],[32,1,32,2],[32,4,32,6],[32,10,32,11],[32,12,32,13],[32,15,32,16],[26,0,26,18],[27,0,27,18],[28,1,28,8],[28,10,28,18],[29,1,29,2],[29,4,29,6],[29,10,29,11],[29,12,29,13],[29,15,29,16],[24,0,24,7],[24,10,24,11],[24,13,24,17],[25,0,25,2],[25,3,25,4],[25,5,25,6],[25,7,25,8],[25,10,25,11],[25,13,25,17],[23,4,23,5],[23,10,23,11],[23,13,23,17],[19,4,19,5],[19,13,19,15],[19,16,19,17],[20,4,20,5],[20,13,20,15],[20,16,20,17],[21,4,21,5],[21,13,21,15],[21,16,21,17],[22,4,22,5],[22,13,22,17],[16,4,16,5],[16,10,22,12],[16,13,16,15],[16,16,16,17],[17,4,17,5],[17,13,17,15],[17,16,17,17],[18,4,18,5],[18,13,18,15],[18,16,18,17],[13,0,14,8],[13,10,13,11],[14,10,14,11],[15,0,15,1],[15,4,15,5],[15,10,15,17],[9,2,9,3],[9,4,9,8],[9,10,9,11],[10,1,10,3],[10,4,12,8],[10,10,10,11],[11,1,11,3],[11,10,11,11],[12,1,12,3],[12,10,12,11],[6,1,6,3],[7,0,7,3],[7,5,7,6],[7,10,7,11],[8,4,8,8],[8,10,8,11],[3,17,4,17],[3,18,4,18],[4,1,4,3],[4,4,4,7],[5,1,5,3],[5,5,5,6],[5,10,5,11],[3,0,3,6],[3,10,4,12],[3,13,4,13],[3,14,4,14],[3,15,4,15],[3,16,4,16],[0,2,0,3],[0,13,0,18],[1,0,1,8],[1,10,1,18],[2,3,2,4],[2,10,2,12]]}
["TRAVEL DOCUMENT #",null,"XXXXX"]
["I                                  TRAVELER/TRIP INFORMATION",null,null,null,null,null,null,null,null,null,"III                       TRAVEL CLAIM (To be completed after trip)"]
["Date prepared:","2014-05-15","Prepared By:",null,null,"MS#",null,"Phone:","x5-0000",null,"TRAVEL COST",null,null,"FUND","AGCY","ORGN","OBJT","SOBJ","AMOUNT"]
[null,null,null,null,null,null,null,"Fax:",null,null,"Airfare                                                           (attach airline ticket & itinerary)",null,null,null,null,null,null,null,{"$f":"IF(TIW!$C$1=\"Post-Trip\",(TIW!E25+TIW!E26),IF(TIW!$C$1=\"Both\",(TIW!E25+TIW!E26),\"$0.00\"))","v":"$0.00"}]
["Name:","Last",null,null,"First",null,null,null,"Middle"]
["Vendor code:",null,null,null,"Depart Date",null,null,"Time:",null,null,"Mileage",null,"Form",null,null,null,null,null,{"$f":"IF(TIW!$C$1=\"Post-Trip\",(TIW!G25+TIW!G26),IF(TIW!$C$1=\"Both\",(TIW!G25+TIW!G26),\"$0.00\"))","v":"$0.00"}]
["Address:",null,null,null,null,null,null,null,null,null,"LODGING","RATES","Form",null,null,null,null,null,{"$f":"IF(TIW!$C$1=\"Post-Trip\",(TIW!I25+TIW!I26),IF(TIW!$C$1=\"Both\",(TIW!I25+TIW!I26),\"$0.00\"))","v":"$0.00"}]
[null,null,null,null,"Return Date",null,null,"Time:",null,null,"MEAL PER DIEM",null,null,null,null,null,null,null,{"$f":"IF(TIW!$C$1=\"Post-Trip\",(TIW!K27+TIW!M27),IF(TIW!$C$1=\"Both\",(TIW!K27+TIW!M27),\"$0.00\"))","v":"$0.00"}]
["Dept:",null,"M/S #:",null,"Purpose Code: ",null,null,null,null,null,"HOST EXPENSE",null,"Form",null,null,null,null,null,{"$f":"IF(TIW!$C$1=\"Post-Trip\",(TIW!N25+TIW!N26),IF(TIW!$C$1=\"Both\",(TIW!N25+TIW!N26),\"$0.00\"))","v":"$0.00"}]
["Destinations","County:",null,null,"Purpose",null,null,null,null,null,"REGISTRATION FEE",null,null,null,null,null,null,null,{"$f":"IF(TIW!$C$1=\"Post-Trip\",(TIW!O25+TIW!O26),IF(TIW!$C$1=\"Both\",(TIW!O25+TIW!O26),\"$0.00\"))","v":"$0.00"}]
["1.) ","Destination",null,null,null,null,null,null,null,null,"CAR RENTAL",null,"Form",null,null,null,null,null,{"$f":"IF(TIW!$C$1=\"Post-Trip\",(TIW!P25+TIW!P26),IF(TIW!$C$1=\"Both\",(TIW!P25+TIW!P26),\"$0.00\"))","v":"$0.00"}]
["2.) ","Destination",null,null,null,null,null,null,null,null,"TAXI, BUS, ETC",null,"Read",null,null,null,null,null,{"$f":"IF(TIW!$C$1=\"Post-Trip\",(TIW!Q25+TIW!Q26),IF(TIW!$C$1=\"Both\",(TIW!Q25+TIW!Q26),\"$0.00\"))","v":"$0.00"}]
["3.)",null,null,null,null,null,null,null,null,null,"PARKING",null,null,null,null,null,null,null,{"$f":"IF(TIW!$C$1=\"Post-Trip\",(TIW!R25+TIW!R26),IF(TIW!$C$1=\"Both\",(TIW!R25+TIW!R26),\"$0.00\"))","v":"$0.00"}]
["II   TRAVEL AUTHORIZATION (MUST BE COMPLETED PRIOR TO TRIP)",null,null,null,null,null,null,null,null,null,"OTHER ",null,"Read",null,null,null,null,null,{"$f":"IF(TIW!$C$1=\"Post-Trip\",(TIW!S25+TIW!S26),IF(TIW!$C$1=\"Both\",(TIW!S25+TIW!S26),\"$0.00\"))","v":"$0.00"}]
[null,null,null,null,null,null,null,null,null,null,"OTHER",null,"Read"]
{"$rows_left_out":22}
{"sheet":"Drop Down Menu","index":1,"n_rows":3325,"n_cols":15,"rows_kept":3325,"cut":false,"hidden":true,"merged":[]}
["Destination","Purpose","Fund","Agcy","Org","Obj","Sobj","Select Name","Other","Select Method of Travel","Select Mileage Type","Prepay type",null,null,"Select"]
["ARGO          ARGONNE IL                      ","AST       ASTRONOMICAL OBSERVATIONS",2101,201,"0004 ",21,"CR","A RYCHELLE TOMLIN  ","Internet","Air","CY 16 Personal","PO",null,null,"Pre-Trip"]
["CHIC          CHICAGO, IL                    ","ATC       ATHLETIC COMPETITION",2102,202,"0007 ",23,"LO","AARON BELL  ","Phone","Enterprise Rental","CY 16 UNLV","P-card",null,null,"Post-Trip"]
["LASV          LAS VEGAS NV                   ","ATH       ATHLETIC TEAM TRAVEL",2104,203,"0011 ",24,"T1","AARON SHEPPARD  ","Copies","Hertz Rental ","CY 17 Personal","Diners Card",null,null,"Both"]
["RENO          RENO NV                        ","ATL       ATHLETIC GAME SUPPLIES",2105,206,"0019 ",25,"T2","AARON THOMPSON  ","Supplies","Motorpool (Reno)","CY 17 UNLV","3rd Party"]
["AARH          AARHUS DENMARK                  ","ATP       ATHLETIC PRE-GAME ARRANGEMENTS",2108,208,"0042 ",30,"T3","ADAM CRONIS  ","Taxi","Advantage Rental",null,"2PV"]
["ABER          ABERDEEN MD                  ","ATT       ATHLETIC TRAINING",2122,209,"0046 ",33,"T4","ADAM GUILBEAULT  ","Shuttle","Personal Vehicle",null,"Not Claiming"]
["ABIL          ABILINE KA                      ","AUD       AUDITIONS",2150,211,"0053 ",38,"T5","ADAM LELAND  ",null,"Train",null,"Type Information"]
["ABIN          ABINGTON PA                     ","AUI       CONDUCT AUDIT",2202,212,"0054 ",null,"T6","ADAM SIKULA  ",null,"Unlv Vehicle"]
["ACAP          ACAPULCO MEXICO                ","AWA       AWARD, RECEIVE AN AWARD",2205,213,"0059 ",null,"T7","ADAM SIMON  "]
["ACCR          ACCRA TURKEY                    ","BAN       BANQUET (UNDEFINED)",2220,214,"0062 ",null,"T8","ADRIENNE EKAS  "]
["ADDI          ADDIS ABABA ETHIOPIA            ","BEA       BEAMTIME",2221,215,"0065 ",null,"TC","ALAN PERSONIUS  "]
["ADDS          ADDISON TX                      ","BOR       BOARD OF REGENTS MEETING",2222,216,"0066 ",null,"TO","ALAN SIMMONS  "]
["ADEL          ADELAIDE AUSTRALIA              ","BRO       BROADCAST ATHLETIC EVENT/GAMES",2226,217,"0071 ",null,26,"ALEXANA LAMAN-LYONS  "]
["ADEP          ADELPHI MD                      ","BUD       BUDGET MEETING(S)",2230,218,"0072 ",null,"HD","ALEXANDRA NIKOLICH  "]
{"$rows_left_out":3311}
{"sheet":"TIW","index":2,"n_rows":32,"n_cols":19,"rows_kept":32,"cut":false,"hidden":false,"merged":[[29,5,29,6],[29,9,33,18],[30,5,30,6],[31,5,31,6],[22,10,23,10],[22,11,23,11],[22,12,23,12],[22,15,23,15],[22,17,23,17],[22,0,23,0],[22,3,23,3],[22,4,23,4],[22,5,23,5],[22,9,23,9],[20,10,21,10],[20,11,21,11],[20,12,21,12],[20,15,21,15],[20,17,21,17],[20,0,21,0],[20,3,21,3],[20,4,21,4],[20,5,21,5],[20,9,21,9],[18,10,19,10],[18,11,19,11],[18,12,19,12],[18,15,19,15],[18,17,19,17],[18,0,19,0],[18,3,19,3],[18,4,19,4],[18,5,19,5],[18,9,19,9],[16,10,17,10],[16,11,17,11],[16,12,17,12],[16,15,17,15],[16,17,17,17],[16,0,17,0],[16,3,17,3],[16,4,17,4],[16,5,17,5],[16,9,17,9],[14,10,15,10],[14,11,15,11],[14,12,15,12],[14,15,15,15],[14,17,15,17],[14,0,15,0],[14,3,15,3],[14,4,15,4],[14,5,15,5],[14,9,15,9],[12,10,13,10],[12,11,13,11],[12,12,13,12],[12,15,13,15],[12,17,13,17],[12,0,13,0],[12,3,13,3],[12,4,13,4],[12,5,13,5],[12,9,13,9],[8,18,9,18],[10,0,11,0],[10,3,11,3],[10,4,11,4],[10,5,11,5],[10,9,11,9],[10,10,11,10],[10,11,11,11],[10,12,11,12],[10,15,11,15],[10,17,11,17],[6,11,6,17],[8,0,9,0],[8,1,9,1],[8,2,9,2],[8,3,9,3],[8,4,9,4],[8,5,9,5],[8,9,8,11],[8,14,9,14],[8,16,9,16],[8,17,9,17],[0,0,4,0],[0,2,1,2],[0,3,0,10],[1,3,1,10],[1,16,1,18],[2,3,2,10],[2,16,2,18],[3,2,3,13]]}
["UNLV",null,"Select","University of Nevada, Las Vegas"]
[null,null,null,"TRAVEL ITINERARY WORKSHEET",null,null,null,null,null,null,null,null,null,null,null,"TD# ",{"$f":"'TRAVEL DOCUMENT'!C1","v":"XXXXX"}]
[null,null,null,null,null,null,null,null,null,null,null,null,null,null,null,"2PV","Xxxxxxx"]
[null,null,"***  Use Drop down Menu in upper left hand corner for Pre-Travel and Post Travel ***"]
[null,null,null,null,null,null,null,null,null,null,null,null,null,null,1,"Page","of",null,"Pages"]
[]
["Traveler's Name: ",null,{"$f":"'TRAVEL DOCUMENT'!B5","v":"Last"},{"$f":"'TRAVEL DOCUMENT'!E5","v":"First"},null,null,null,null,"Traveler's Vendor Number:  ",null,null,{"$f":"'TRAVEL DOCUMENT'!B6","v":0}]
[]
["DATE","TIME","LOCATION","*METHOD OF TRAVEL","Amount for Method of Travel","Type of Mileage","Mileage",null,"*LODGING","MEALS & INCIDENTALS",null,null,"Foreign","*Host Expense","*Registration","*Car Rental","Taxi, Bus, Etc.","Parking","Other"]
[null,null,null,null,null,null,"Form",null,"Form","BREAKFAST","LUNCH","DINNER","Incidental","Form",null,"Form"]
[null,"08:50:00","Destination","Air",null,"Select Mileage Type",null,"Room Rate"]
[null,"00:00:00","Destination",null,null,null,{"$f":"IF(F11=\"CY 16 Personal\",G11*0.27,IF(F11=\"CY 16 UNLV\",G11*0.54,IF(F11=\"CY 17 Personal\",G11*0.2675, IF(F11=\"CY 17 UNLV\",G11*0.535,\"0.00\"))))","v":"0.00"},"Tax"]
[null,null,"Destination",null,null,null,null,"Room Rate"]
[null,null,"Destination",null,null,null,{"$f":"IF(F13=\"CY 16 Personal\",G13*0.27,IF(F13=\"CY 16 UNLV\",G13*0.54,IF(F13=\"CY 17 Personal\",G13*0.2675, IF(F13=\"CY 17 UNLV\",G13*0.535,\"0.00\"))))","v":"0.00"},"Tax"]
[null,null,"Destination",null,null,null,null,"Room Rate"]
{"$rows_left_out":18}
{"sheet":"TIW-2","index":3,"n_rows":31,"n_cols":19,"rows_kept":31,"cut":false,"hidden":false,"merged":[[22,0,23,0],[22,3,23,3],[22,4,23,4],[22,5,23,5],[22,9,23,9],[20,10,21,10],[20,11,21,11],[28,9,32,18],[20,12,21,12],[20,15,21,15],[20,17,21,17],[22,10,23,10],[22,11,23,11],[22,12,23,12],[22,15,23,15],[22,17,23,17],[25,9,25,12],[25,17,26,18],[20,0,21,0],[20,3,21,3],[20,4,21,4],[20,5,21,5],[20,9,21,9],[18,10,19,10],[18,11,19,11],[18,12,19,12],[18,15,19,15],[18,17,19,17],[18,0,19,0],[18,3,19,3],[18,4,19,4],[18,5,19,5],[18,9,19,9],[16,10,17,10],[16,11,17,11],[16,12,17,12],[16,15,17,15],[16,17,17,17],[16,0,17,0],[16,3,17,3],[16,4,17,4],[16,5,17,5],[16,9,17,9],[14,10,15,10],[14,11,15,11],[14,12,15,12],[14,15,15,15],[14,17,15,17],[14,0,15,0],[14,3,15,3],[14,4,15,4],[14,5,15,5],[14,9,15,9],[12,10,13,10],[12,11,13,11],[12,12,13,12],[12,15,13,15],[12,17,13,17],[12,0,13,0],[12,3,13,3],[12,4,13,4],[12,5,13,5],[12,9,13,9],[8,18,9,18],[10,0,11,0],[10,3,11,3],[10,4,11,4],[10,5,11,5],[10,9,11,9],[10,10,11,10],[10,11,11,11],[10,12,11,12],[10,15,11,15],[10,17,11,17],[6,11,6,17],[8,0,9,0],[8,1,9,1],[8,2,9,2],[8,3,9,3],[8,4,9,4],[8,5,9,5],[8,9,8,11],[8,14,9,14],[8,16,9,16],[8,17,9,17],[0,0,4,0],[0,2,1,2],[0,3,0,10],[1,3,1,10],[1,16,1,18],[2,3,2,10],[2,16,2,18]]}
["UNLV",null,{"$f":"IF([1]TIW!C1:C2=\"Pre-trip\",\"Pre-Trip\",IF([1]TIW!C1:C2=\"Post-trip\",\"Post-Trip\",IF([1]TIW!C1:C2=\"Both\",\"Both \",IF([1]TIW!C1:C2=\"Select\",\"\"))))","v":""},"University of Nevada, Las Vegas"]
[null,null,null,"TRAVEL ITINERARY WORKSHEET",null,null,null,null,null,null,null,null,null,null,null,"TD# ",{"$f":"'TRAVEL DOCUMENT'!C1","v":"XXXXX"}]
[null,null,null,null,null,null,null,null,null,null,null,null,null,null,null,"2PV","Xxxxxxx"]
[]
[null,null,null,null,null,null,null,null,null,null,null,null,null,null,2,"Page","of",null,"Pages"]
[]
["Traveler's Name: ",null,{"$f":"'TRAVEL DOCUMENT'!B5","v":"Last"},{"$f":"'TRAVEL DOCUMENT'!E5","v":"First"},null,null,null,null,"Traveler's Vendor Number:  ",null,null,{"$f":"'TRAVEL DOCUMENT'!B6","v":0}]
[]
["DATE","TIME","LOCATION","*METHOD OF TRAVEL","Amount for Method of Travel","Type of Mileage","Mileage",null,"*LODGING","MEALS & INCIDENTALS",null,null,"Foreign","*Host Expense","*Registration","*Car Rental","Taxi, Bus, Etc.","Parking","Other"]
[null,null,null,null,null,null,"Form",null,"Form","BREAKFAST","LUNCH","DINNER","Incidental","Form",null,"Form"]
[null,"08:50:00","Destination","Select Method of Travel",null,"Select Mileage Type",null,"Room Rate"]
[null,"00:00:00","Destination",null,null,null,{"$f":"IF(F11=\"CY 16 Personal\",G11*0.27,IF(F11=\"CY 16 UNLV\",G11*0.54,IF(F11=\"CY 17 Personal\",G11*0.2675, IF(F11=\"CY 17 UNLV\",G11*0.535,\"0.00\"))))","v":"0.00"},"Tax"]
[null,null,"Destination",null,null,null,null,"Room Rate"]
[null,null,"Destination",null,null,null,{"$f":"IF(F13=\"CY 16 Personal\",G13*0.27,IF(F13=\"CY 16 UNLV\",G13*0.54,IF(F13=\"CY 17 Personal\",G13*0.2675, IF(F13=\"CY 17 UNLV\",G13*0.535,\"0.00\"))))","v":"0.00"},"Tax"]
[null,null,"Destination",null,null,null,null,"Room Rate"]
{"$rows_left_out":17}
{"sheet":"TIW-3","index":4,"n_rows":31,"n_cols":19,"rows_kept":31,"cut":false,"hidden":false,"merged":[[25,9,25,12],[25,17,26,18],[28,9,32,18],[22,10,23,10],[22,11,23,11],[22,12,23,12],[22,15,23,15],[22,17,23,17],[22,0,23,0],[22,3,23,3],[22,4,23,4],[22,5,23,5],[22,9,23,9],[20,10,21,10],[20,11,21,11],[20,12,21,12],[20,15,21,15],[20,17,21,17],[20,0,21,0],[20,3,21,3],[20,4,21,4],[20,5,21,5],[20,9,21,9],[18,10,19,10],[18,11,19,11],[18,12,19,12],[18,15,19,15],[18,17,19,17],[18,0,19,0],[18,3,19,3],[18,4,19,4],[18,5,19,5],[18,9,19,9],[16,10,17,10],[16,11,17,11],[16,12,17,12],[16,15,17,15],[16,17,17,17],[16,0,17,0],[16,3,17,3],[16,4,17,4],[16,5,17,5],[16,9,17,9],[14,10,15,10],[14,11,15,11],[14,12,15,12],[14,15,15,15],[14,17,15,17],[14,0,15,0],[14,3,15,3],[14,4,15,4],[14,5,15,5],[14,9,15,9],[12,10,13,10],[12,11,13,11],[12,12,13,12],[12,15,13,15],[12,17,13,17],[12,0,13,0],[12,3,13,3],[12,4,13,4],[12,5,13,5],[12,9,13,9],[8,18,9,18],[10,0,11,0],[10,3,11,3],[10,4,11,4],[10,5,11,5],[10,9,11,9],[10,10,11,10],[10,11,11,11],[10,12,11,12],[10,15,11,15],[10,17,11,17],[6,11,6,17],[8,0,9,0],[8,1,9,1],[8,2,9,2],[8,3,9,3],[8,4,9,4],[8,5,9,5],[8,9,8,11],[8,14,9,14],[8,16,9,16],[8,17,9,17],[0,0,4,0],[0,2,1,2],[0,3,0,10],[1,3,1,10],[1,16,1,18],[2,3,2,10],[2,16,2,18]]}
["UNLV",null,{"$f":"IF([1]TIW!C1:C2=\"Pre-trip\",\"Pre-Trip\",IF([1]TIW!C1:C2=\"Post-trip\",\"Post-Trip\",IF([1]TIW!C1:C2=\"Both\",\"Both \",IF([1]TIW!C1:C2=\"Select\",\"\"))))","v":""},"University of Nevada, Las Vegas"]
[null,null,null,"TRAVEL ITINERARY WORKSHEET",null,null,null,null,null,null,null,null,null,null,null,"TD# ",{"$f":"'TRAVEL DOCUMENT'!C1","v":"XXXXX"}]
[null,null,null,null,null,null,null,null,null,null,null,null,null,null,null,"2PV","Xxxxxxx"]
[]
[null,null,null,null,null,null,null,null,null,null,null,null,null,null,2,"Page","of",null,"Pages"]
[]
["Traveler's Name: ",null,{"$f":"'TRAVEL DOCUMENT'!B5","v":"Last"},{"$f":"'TRAVEL DOCUMENT'!E5","v":"First"},null,null,null,null,"Traveler's Vendor Number:  ",null,null,{"$f":"'TRAVEL DOCUMENT'!B6","v":0}]
[]
["DATE","TIME","LOCATION","*METHOD OF TRAVEL","Amount for Method of Travel","Type of Mileage","Mileage",null,"*LODGING","MEALS & INCIDENTALS",null,null,"Foreign","*Host Expense","*Registration","*Car Rental","Taxi, Bus, Etc.","Parking","Other"]
[null,null,null,null,null,null,"Form",null,"Form","BREAKFAST","LUNCH","DINNER","Incidental","Form",null,"Form"]
[null,"08:50:00","Destination","Select Method of Travel",null,"Select Mileage Type",null,"Room Rate"]
[null,"00:00:00","Destination",null,null,null,{"$f":"IF(F11=\"CY 16 Personal\",G11*0.27,IF(F11=\"CY 16 UNLV\",G11*0.54,IF(F11=\"CY 17 Personal\",G11*0.2675, IF(F11=\"CY 17 UNLV\",G11*0.535,\"0.00\"))))","v":"0.00"},"Tax"]
[null,null,"Destination",null,null,null,null,"Room Rate"]
[null,null,"Destination",null,null,null,{"$f":"IF(F13=\"CY 16 Personal\",G13*0.27,IF(F13=\"CY 16 UNLV\",G13*0.54,IF(F13=\"CY 17 Personal\",G13*0.2675, IF(F13=\"CY 17 UNLV\",G13*0.535,\"0.00\"))))","v":"0.00"},"Tax"]
[null,null,"Destination",null,null,null,null,"Room Rate"]
{"$rows_left_out":17}
{"sheet":"TIW-4","index":5,"n_rows":31,"n_cols":19,"rows_kept":31,"cut":false,"hidden":false,"merged":[[0,0,4,0],[0,2,1,2],[0,3,0,10],[1,3,1,10],[1,16,1,18],[2,3,2,10],[2,16,2,18],[6,11,6,17],[8,0,9,0],[8,1,9,1],[8,2,9,2],[8,3,9,3],[8,4,9,4],[8,5,9,5],[8,9,8,11],[8,14,9,14],[8,16,9,16],[8,17,9,17],[8,18,9,18],[10,0,11,0],[10,3,11,3],[10,4,11,4],[10,5,11,5],[10,9,11,9],[10,10,11,10],[10,11,11,11],[10,12,11,12],[10,15,11,15],[10,17,11,17],[12,0,13,0],[12,3,13,3],[12,4,13,4],[12,5,13,5],[12,9,13,9],[12,10,13,10],[12,11,13,11],[12,12,13,12],[12,15,13,15],[12,17,13,17],[14,0,15,0],[14,3,15,3],[14,4,15,4],[14,5,15,5],[14,9,15,9],[14,10,15,10],[14,11,15,11],[14,12,15,12],[14,15,15,15],[14,17,15,17],[16,0,17,0],[16,3,17,3],[16,4,17,4],[16,5,17,5],[16,9,17,9],[16,10,17,10],[16,11,17,11],[16,12,17,12],[16,15,17,15],[16,17,17,17],[18,0,19,0],[18,3,19,3],[18,4,19,4],[18,5,19,5],[18,9,19,9],[18,10,19,10],[18,11,19,11],[18,12,19,12],[18,15,19,15],[18,17,19,17],[20,0,21,0],[20,3,21,3],[20,4,21,4],[20,5,21,5],[20,9,21,9],[20,10,21,10],[20,11,21,11],[20,12,21,12],[20,15,21,15],[20,17,21,17],[22,0,23,0],[22,3,23,3],[22,4,23,4],[22,5,23,5],[22,9,23,9],[25,9,25,12],[25,17,26,18],[28,9,32,18],[22,10,23,10],[22,11,23,11],[22,12,23,12],[22,15,23,15],[22,17,23,17]]}
["UNLV",null,{"$f":"IF([1]TIW!C1:C2=\"Pre-trip\",\"Pre-Trip\",IF([1]TIW!C1:C2=\"Post-trip\",\"Post-Trip\",IF([1]TIW!C1:C2=\"Both\",\"Both \",IF([1]TIW!C1:C2=\"Select\",\"\"))))","v":""},"University of Nevada, Las Vegas"]
[null,null,null,"TRAVEL ITINERARY WORKSHEET",null,null,null,null,null,null,null,null,null,null,null,"TD# ",{"$f":"'TRAVEL DOCUMENT'!C1","v":"XXXXX"}]
[null,null,null,null,null,null,null,null,null,null,null,null,null,null,null,"2PV","Xxxxxxx"]
[]
[null,null,null,null,null,null,null,null,null,null,null,null,null,null,2,"Page","of",null,"Pages"]
[]
["Traveler's Name: ",null,{"$f":"'TRAVEL DOCUMENT'!B5","v":"Last"},{"$f":"'TRAVEL DOCUMENT'!E5","v":"First"},null,null,null,null,"Traveler's Vendor Number:  ",null,null,{"$f":"'TRAVEL DOCUMENT'!B6","v":0}]
[]
["DATE","TIME","LOCATION","*METHOD OF TRAVEL","Amount for Method of Travel","Type of Mileage","Mileage",null,"*LODGING","MEALS & INCIDENTALS",null,null,"Foreign","*Host Expense","*Registration","*Car Rental","Taxi, Bus, Etc.","Parking","Other"]
[null,null,null,null,null,null,"Form",null,"Form","BREAKFAST","LUNCH","DINNER","Incidental","Form",null,"Form"]
[null,"08:50:00","Destination","Select Method of Travel",null,"Select Mileage Type",null,"Room Rate"]
[null,"00:00:00","Destination",null,null,null,{"$f":"IF(F11=\"CY 16 Personal\",G11*0.27,IF(F11=\"CY 16 UNLV\",G11*0.54,IF(F11=\"CY 17 Personal\",G11*0.2675, IF(F11=\"CY 17 UNLV\",G11*0.535,\"0.00\"))))","v":"0.00"},"Tax"]
[null,null,"Destination",null,null,null,null,"Room Rate"]
[null,null,"Destination",null,null,null,{"$f":"IF(F13=\"CY 16 Personal\",G13*0.27,IF(F13=\"CY 16 UNLV\",G13*0.54,IF(F13=\"CY 17 Personal\",G13*0.2675, IF(F13=\"CY 17 UNLV\",G13*0.535,\"0.00\"))))","v":"0.00"},"Tax"]
[null,null,"Destination",null,null,null,null,"Room Rate"]
{"$rows_left_out":17}
{"sheet":"Lodging Exception Form 2","index":6,"n_rows":44,"n_cols":14,"rows_kept":44,"cut":false,"hidden":false,"merged":[[0,0,0,13],[1,7,1,11],[2,3,2,4],[2,5,2,6],[2,7,5,11],[3,3,3,4],[3,5,3,6],[4,3,4,4],[4,5,4,6],[5,3,5,4],[5,5,5,6],[6,0,6,13],[8,0,8,3],[8,4,9,5],[8,7,9,13],[9,0,9,3],[12,0,12,6],[12,7,12,13],[13,0,15,6],[13,7,15,13],[16,0,16,6],[16,7,16,13],[33,6,33,7],[33,8,33,11],[20,0,20,13],[21,0,21,13],[22,0,22,13],[23,0,25,13],[27,4,27,11],[28,0,33,2],[28,4,28,5],[28,6,28,7],[28,8,28,11],[28,13,33,13],[29,4,29,5],[29,6,29,7],[29,8,29,11],[36,0,37,13],[38,0,38,4],[38,5,38,9],[38,10,38,13],[17,1,17,6],[18,1,18,6],[19,1,19,6],[17,8,17,13],[18,8,18,13],[19,8,19,13],[32,4,32,7],[32,8,32,11],[34,4,34,5],[34,6,34,7],[34,8,34,11],[33,4,33,5],[43,1,43,4],[43,6,43,9],[43,11,43,13],[42,2,42,12],[39,1,39,4],[39,6,39,9],[39,11,39,13],[40,0,40,13]]}
["Lodging Exception Approval Form"]
[null,null,null,null,null,null,null,"List additional notes here:"]
[null,null,null,"Travel Document #:"]
[null,null,null,"Traveler Name:"]
[null,null,null,"Travel Destination:"]
[null,null,null,"Travel Dates:"]
["Condition Requirements"]
[]
["Condition applied ",null,null,null,null,null,null,"NOTE: The only exception that can be granted over the GSA/Federal lodging rates are if a traveler can document one of the two conditions below.  (\"A\" or \"B\") exists and an appropriate appointing authority approves the request in advance of the travel. Lodging exceptions are valid with the proper approval from vice presidents, associate vice presidents, deans and associate deans or the equivalent."]
["Enter \"A\"or \"B\" "]
[]
[]
["        Condition:  A",null,null,null,null,null,null,"          Condition B:"]
["A.        Lodging is procured at a prearranged place such as a hotel where a meeting, conference or training session is held.  ",null,null,null,null,null,null,"B.          Costs have escalated because of special events; lodging within prescribed allowances cannot be obtained nearby ; and costs to commute to/from the nearby location exceed the cost savings from occupying less expensive lodging. "]
[]
{"$rows_left_out":30}
{"sheet":"Rental Exception Request","index":7,"n_rows":27,"n_cols":11,"rows_kept":27,"cut":false,"hidden":false,"merged":[[10,12,11,15],[26,3,26,4],[26,5,26,8],[26,10,27,11],[26,12,27,15],[23,3,23,4],[23,5,23,8],[23,10,23,11],[23,12,23,15],[24,3,24,4],[24,5,24,8],[24,10,25,11],[24,12,25,15],[0,1,0,16],[1,1,1,16],[3,1,7,16],[8,1,8,16],[25,3,25,4],[25,5,25,8],[13,2,14,3],[13,10,16,11],[13,12,21,15],[15,3,16,6],[15,7,16,7],[17,10,21,11],[19,2,20,3],[10,3,11,3],[10,4,11,6],[10,10,11,11]]}
[null,"Non Contracted Vehicle Rental "]
[null,"Request for Authorization Form"]
[]
[null,"This authorization form does not guarantee reimbursement of funds. Review of the travel document is needed as a state contracted agency was not used for your vehicle rental needs. Per NSHE policy state agency contracts must be used to insure the required insurance as well as cost controls are in effect during the rental period.   If there are extenuating circumstances, which did not allow use of the state contract, please provide a detailed explanation immediately.                                    "]
[]
[]
[]
[]
[null,"                  If the explanation is not acceptable the following adjustment will be made to your travel document.                                      "]
[]
[null,null,null,"TD#",null,null,null,null,null,null,"Traveler's Name"]
[]
[]
[null,null,"A: If paid out-of-pocket:",null,null,null,null,null,null,null,"Reason for not using contracted agency:"]
[]
{"$rows_left_out":13}
{"sheet":"Sheet2","index":8,"n_rows":7,"n_cols":2,"rows_kept":7,"cut":false,"hidden":true,"merged":[]}
["Select GSA Rate","Out of State-            Surveyed"]
["Out of State-            Surveyed"]
["Out of State-   Non-Surveyed"]
["In State-                    Surveyed"]
["InState-            Non-Surveyed"]
["Foreign-                    Surveyed"]
["Foreign-           Non-Surveyed"]